{"text_format":"1","workbook":"xlsx","n_sheets":4,"sheets":["地図","冒険の書","使い方マニュアル","DATA"],"not_rendered":{"charts":0,"images":59,"macros":1,"external_links":0,"defined_names":24,"comments":2,"pivot_tables":0},"unopened":[],"bounds":{"document_bytes":16777216,"sheet_cells":100000,"rows_first":2000,"rows_last":500,"rows_between":2000,"halvings":0,"cell_chars":16384,"cell_head_chars":4096},"cells_cut":0,"cells_raw":0,"read":"whole","date_system":"1900"}

{"sheet":"地図","index":0,"n_rows":46,"n_cols":93,"rows_kept":46,"cut":false,"hidden":false,"merged":[[39,5,41,17],[5,1,6,17],[4,6,4,17],[4,1,4,5],[8,1,10,8],[7,1,7,8],[7,10,7,17],[36,6,37,7],[8,16,9,17],[8,10,9,11],[8,12,8,15],[1,16,2,17],[1,1,2,2],[3,30,3,33],[4,30,4,33],[5,30,5,33],[2,30,2,33],[3,27,3,29],[2,22,5,25],[12,22,12,25],[6,22,6,29],[2,27,2,29],[4,27,4,29],[5,27,5,29],[7,22,7,29],[12,26,12,28],[8,22,8,27],[8,28,8,33],[9,22,10,27],[9,28,10,33],[6,30,6,33],[7,30,7,33],[12,30,12,33],[16,28,17,33],[18,28,18,33],[20,28,20,33],[14,22,14,26],[24,26,24,27],[23,26,23,27],[24,22,24,25],[23,22,23,25],[20,22,20,27],[16,22,18,27],[27,22,27,25],[27,28,27,31],[25,26,25,27],[26,26,26,27],[27,26,27,27],[27,32,27,33],[22,32,22,33],[22,29,22,30],[24,32,24,33],[23,32,23,33],[24,28,24,31],[23,28,23,31],[22,27,22,28],[25,22,25,25],[25,28,25,31],[26,22,26,25],[26,28,26,31],[25,32,25,33],[26,32,26,33],[2,37,5,40],[2,42,2,44],[2,45,2,48],[3,42,3,44],[3,45,3,48],[4,42,4,44],[4,45,4,48],[5,42,5,44],[5,45,5,48],[9,37,10,42],[9,43,10,48],[12,37,12,40],[12,41,12,43],[12,45,12,48],[6,37,6,44],[6,45,6,48],[7,37,7,44],[7,45,7,48],[8,37,8,42],[8,43,8,48],[22,42,22,43],[22,44,22,45],[22,47,22,48],[23,37,23,40],[23,41,23,42],[23,43,23,46],[23,47,23,48],[14,37,14,41],[16,37,18,42],[16,43,17,48],[18,43,18,48],[20,37,20,42],[20,43,20,48],[26,37,26,40],[26,41,26,42],[26,43,26,46],[26,47,26,48],[27,37,27,40],[27,41,27,42],[27,43,27,46],[27,47,27,48],[24,37,24,40],[24,41,24,42],[24,43,24,46],[24,47,24,48],[25,37,25,40],[25,41,25,42],[25,43,25,46],[25,47,25,48],[2,52,5,55],[2,57,2,59],[2,60,2,63],[3,57,3,59],[3,60,3,63],[4,57,4,59],[4,60,4,63],[5,57,5,59],[5,60,5,63],[6,52,6,59],[6,60,6,63],[7,52,7,59],[7,60,7,63],[8,52,8,57],[8,58,8,63],[9,52,10,57],[9,58,10,63],[12,52,12,55],[12,56,12,58],[12,60,12,63],[14,52,14,56],[16,52,18,57],[16,58,17,63],[18,58,18,63],[20,52,20,57],[20,58,20,63],[22,57,22,58],[22,59,22,60],[22,62,22,63],[23,52,23,55],[23,56,23,57],[23,58,23,61],[23,62,23,63],[24,52,24,55],[24,56,24,57],[24,58,24,61],[24,62,24,63],[25,52,25,55],[25,56,25,57],[25,58,25,61],[25,62,25,63],[26,52,26,55],[26,56,26,57],[26,58,26,61],[26,62,26,63],[27,52,27,55],[27,56,27,57],[27,58,27,61],[27,62,27,63],[2,67,5,70],[7,67,7,74],[16,67,18,72],[16,73,17,78],[18,73,18,78],[20,67,20,72],[20,73,20,78],[22,72,22,73],[22,74,22,75],[22,77,22,78],[23,67,23,70],[23,71,23,72],[23,73,23,76],[23,77,23,78],[24,67,24,70],[24,71,24,72],[2,72,2,74],[2,75,2,78],[3,72,3,74],[3,75,3,78],[4,72,4,74],[4,75,4,78],[5,72,5,74],[5,75,5,78],[6,67,6,74],[6,75,6,78],[7,75,7,78],[8,67,8,72],[8,73,8,78],[9,67,10,72],[9,73,10,78],[12,67,12,70],[12,71,12,73],[12,75,12,78],[14,67,14,71],[24,73,24,76],[24,77,24,78],[25,67,25,70],[25,71,25,72],[25,73,25,76],[25,77,25,78],[26,67,26,70],[26,71,26,72],[26,73,26,76],[26,77,26,78],[27,67,27,70],[27,71,27,72],[27,73,27,76],[27,77,27,78],[2,82,5,85],[2,87,2,89],[2,90,2,93],[3,87,3,89],[3,90,3,93],[4,87,4,89],[4,90,4,93],[5,87,5,89],[5,90,5,93],[6,82,6,89],[6,90,6,93],[7,82,7,89],[7,90,7,93],[8,82,8,87],[8,88,8,93],[9,82,10,87],[9,88,10,93],[12,82,12,85],[12,86,12,88],[12,90,12,93],[14,82,14,86],[16,82,18,87],[16,88,17,93],[18,88,18,93],[20,82,20,87],[20,88,20,93],[22,87,22,88],[22,89,22,90],[22,92,22,93],[26,82,26,85],[26,86,26,87],[26,88,26,91],[26,92,26,93],[27,82,27,85],[27,86,27,87],[27,88,27,91],[27,92,27,93],[23,82,23,85],[23,86,23,87],[23,88,23,91],[23,92,23,93],[24,82,24,85],[24,86,24,87],[24,88,24,91],[24,92,24,93],[25,82,25,85],[25,86,25,87],[25,88,25,91],[25,92,25,93]]}
[]
[]
[null,null,null,null,null,null,null,null,null,null,null,null,null,null,null,null,null,null,null,null,null,null,null,null,null,null,null,"なまえ",null,null,null,null,null,null,null,null,null,null,null,null,null,null,"なまえ",null,null,null,null,null,null,null,null,null,null,null,null,null,null,"なまえ",null,null,null,null,null,null,null,null,null,null,null,null,null,null,"なまえ",null,null,null,null,null,null,null,null,null,null,null,null,null,null,"なまえ"]
[null,null,null,null,null,null,null,null,null,null,null,null,null,null,null,null,null,null,null,null,null,null,null,null,null,null,null,"やくわり",null,null,"せんし",null,null,null,null,null,null,null,null,null,null,null,"やくわり",null,null,"非表示",null,null,null,null,null,null,null,null,null,null,null,"やくわり",null,null,"非表示",null,null,null,null,null,null,null,null,null,null,null,"やくわり",null,null,"非表示",null,null,null,null,null,null,null,null,null,null,null,"やくわり",null,null,"非表示"]
[null,"今回のクエスト→",null,null,null,null,"7：通常",null,null,null,null,null,null,null,null,null,null,null,null,null,null,null,null,null,null,null,null,"レベル",null,null,1,null,null,null,null,null,null,null,null,null,null,null,"レベル",null,null,1,null,null,null,null,null,null,null,null,null,null,null,"レベル",null,null,1,null,null,null,null,null,null,null,null,null,null,null,"レベル",null,null,1,null,null,null,null,null,null,null,null,null,null,null,"レベル",null,null,1]
[null,{"$f":"VLOOKUP(G5,DATA!R18:S28,2,0)","v":"自由に探索します （但し、３マス以上進むことが条件です）\n報酬：生還で１人あたり５  高評価：なし"},null,null,null,null,null,null,null,null,null,null,null,null,null,null,null,null,null,null,null,null,null,null,null,null,null,"たいりょく",null,null,{"$f":"IF(AE4=\"せんし\",AE5*4+16,AE5*3+12)","v":20},null,null,null,null,null,null,null,null,null,null,null,"たいりょく",null,null,{"$f":"IF(AT4=\"せんし\",AT5*4+16,AT5*3+12)","v":15},null,null,null,null,null,null,null,null,null,null,null,"たいりょく",null,null,{"$f":"IF(BI4=\"せんし\",BI5*4+16,BI5*3+12)","v":15},null,null,null,null,null,null,null,null,null,null,null,"たいりょく",null,null,{"$f":"IF(BX4=\"せんし\",BX5*4+16,BX5*3+12)","v":15},null,null,null,null,null,null,null,null,null,null,null,"たいりょく",null,null,{"$f":"IF(CM4=\"せんし\",CM5*4+16,CM5*3+12)","v":15}]
[null,null,null,null,null,null,null,null,null,null,null,null,null,null,null,null,null,null,null,null,null,null,"装備で増えた たいりょく",null,null,null,null,null,null,null,0,null,null,null,null,null,null,"装備で増えた たいりょく",null,null,null,null,null,null,null,0,null,null,null,null,null,null,"装備で増えた たいりょく",null,null,null,null,null,null,null,0,null,null,null,null,null,null,"装備で増えた たいりょく",null,null,null,null,null,null,null,0,null,null,null,null,null,null,"装備で増えた たいりょく",null,null,null,null,null,null,null,0]
[null,"危険な冒険",null,null,null,null,null,null,null,null,"モンスター",null,null,null,null,null,null,null,null,null,null,null,"合計たいりょく",null,null,null,null,null,null,null,{"$f":"AE6+AE7","v":20},null,null,null,null,null,null,"合計たいりょく",null,null,null,null,null,null,null,{"$f":"AT6+AT7","v":15},null,null,null,null,null,null,"合計たいりょく",null,null,null,null,null,null,null,{"$f":"BI6+BI7","v":15},null,null,null,null,null,null,"合計たいりょく",null,null,null,null,null,null,null,{"$f":"BX6+BX7","v":15},null,null,null,null,null,null,"合計たいりょく",null,null,null,null,null,null,null,{"$f":"CM6+CM7","v":15}]
[null,"０：設定なし（通常の冒険）",null,null,null,null,null,null,null,null,null,null,"なし",null,null,null,0,null,null,null,null,null,"受けたダメージ",null,null,null,null,null,"けいけん",null,null,null,null,null,null,null,null,"受けたダメージ",null,null,null,null,null,"けいけん",null,null,null,null,null,null,null,null,"受けたダメージ",null,null,null,null,null,"けいけん",null,null,null,null,null,null,null,null,"受けたダメージ",null,null,null,null,null,"けいけん",null,null,null,null,null,null,null,null,"受けたダメージ",null,null,null,null,null,"けいけん"]
[null,null,null,null,null,null,null,null,null,null,null,null,"攻",{"$f":"VLOOKUP(M9,DATA!M17:P28,3,0)","v":0},"体",{"$f":"VLOOKUP(M9,DATA!M17:P28,4,0)","v":0},null,null,null,null,null,null,0,null,null,null,null,null,0,null,null,null,null,null,null,null,null,0,null,null,null,null,null,0,null,null,null,null,null,null,null,null,0,null,null,null,null,null,0,null,null,null,null,null,null,null,null,0,null,null,null,null,null,0,null,null,null,null,null,null,null,null,0,null,null,null,null,null,0]
[]
[null,null,null,null,null,null,null,null,null,null,null,null,null,null,null,null,null,null,null,null,null,null,"とくぎ",null,null,null,null,null,null,null,null,null,null,null,null,null,null,"とくぎ",null,null,null,null,null,null,null,null,null,null,null,null,null,null,"とくぎ",null,null,null,null,null,null,null,null,null,null,null,null,null,null,"とくぎ",null,null,null,null,null,null,null,null,null,null,null,null,null,null,"とくぎ"]
[null,null,null,null,null,null,null,null,null,null,null,null,null,null,null,null,null,null,null,null,null,null,{"$f":"IF(AE4=\"かりうど\",\"えんごこうげき2\",\"えんごこうげき1\")","v":"えんごこうげき1"},null,null,null,{"$f":"IF(AE4=\"そうりょ\",\"かいふく\",IF(AE4=\"まほうつかい\",\"まほう\",IF(AE4=\"にんじゃ\",\"かぎあけ\",IF(AE4=\"かりうど\",\"おたから\",IF(AE5>=5,\"かいりき\",\"\")))))","v":""},null,null,{"$f":"IF(AE4=\"せんし\",\"\",IF(AE5>=5,2,1))","v":""},{"$f":"IF(AE4=\"にんじゃ\",\"おたから1\",\"\")","v":""},null,null,null,null,null,null,{"$f":"IF(AT4=\"かりうど\",\"えんごこうげき2\",\"えんごこうげき1\")","v":"えんごこうげき1"},null,null,null,{"$f":"IF(AT4=\"そうりょ\",\"かいふく\",IF(AT4=\"まほうつかい\",\"まほう\",IF(AT4=\"にんじゃ\",\"かぎあけ\",IF(AT4=\"かりうど\",\"おたから\",IF(AT5>=5,\"かいりき\",\"\")))))","v":""},null,null,{"$f":"IF(AT4=\"せんし\",\"\",IF(AT5>=5,2,1))","v":1},{"$f":"IF(AT4=\"にんじゃ\",\"おたから1\",\"\")","v":""},null,null,null,null,null,null,{"$f":"IF(BI4=\"かりうど\",\"えんごこうげき2\",\"えんごこうげき1\")","v":"えんごこうげき1"},null,null,null,{"$f":"IF(BI4=\"そうりょ\",\"かいふく\",IF(BI4=\"まほうつかい\",\"まほう\",IF(BI4=\"にんじゃ\",\"かぎあけ\",IF(BI4=\"かりうど\",\"おたから\",IF(BI5>=5,\"かいりき\",\"\")))))","v":""},null,null,{"$f":"IF(BI4=\"せんし\",\"\",IF(BI5>=5,2,1))","v":1},{"$f":"IF(BI4=\"にんじゃ\",\"おたから1\",\"\")","v":""},null,null,null,null,null,null,{"$f":"IF(BX4=\"かりうど\",\"えんごこうげき2\",\"えんごこうげき1\")","v":"えんごこうげき1"},null,null,null,{"$f":"IF(BX4=\"そうりょ\",\"かいふく\",IF(BX4=\"まほうつかい\",\"まほう\",IF(BX4=\"にんじゃ\",\"かぎあけ\",IF(BX4=\"かりうど\",\"おたから\",IF(BX5>=5,\"かいりき\",\"\")))))","v":""},null,null,{"$f":"IF(BX4=\"せんし\",\"\",IF(BX5>=5,2,1))","v":1},{"$f":"IF(BX4=\"にんじゃ\",\"おたから1\",\"\")","v":""},null,null,null,null,null,null,{"$f":"IF(CM4=\"かりうど\",\"えんごこうげき2\",\"えんごこうげき1\")","v":"えんごこうげき1"},null,null,null,{"$f":"IF(CM4=\"そうりょ\",\"かいふく\",IF(CM4=\"まほうつかい\",\"まほう\",IF(CM4=\"にんじゃ\",\"かぎあけ\",IF(CM4=\"かりうど\",\"おたから\",IF(CM5>=5,\"かいりき\",\"\")))))","v":""},null,null,{"$f":"IF(CM4=\"せんし\",\"\",IF(CM5>=5,2,1))","v":1},{"$f":"IF(CM4=\"にんじゃ\",\"おたから1\",\"\")","v":""}]
[null,null,null,null,null,null,null,null,null,null,null,null,null,null,null,null,null,null,null,null,null,null,"特殊なとくぎ",null,null,null,null,null,null,null,null,null,null,null,null,null,null,"特殊なとくぎ",null,null,null,null,null,null,null,null,null,null,null,null,null,null,"特殊なとくぎ",null,null,null,null,null,null,null,null,null,null,null,null,null,null,"特殊なとくぎ",null,null,null,null,null,null,null,null,null,null,null,null,null,null,"特殊なとくぎ"]
[]
[null,null,null,null,null,null,null,null,null,null,null,null,null,null,null,null,null,null,null,null,null,null,"武器と効果",null,null,null,null,null,"防具と効果",null,null,null,null,null,null,null,null,"武器と効果",null,null,null,null,null,"防具と効果",null,null,null,null,null,null,null,null,"武器と効果",null,null,null,null,null,"防具と効果",null,null,null,null,null,null,null,null,"武器と効果",null,null,null,null,null,"防具と効果",null,null,null,null,null,null,null,null,"武器と効果",null,null,null,null,null,"防具と効果"]
[null,null,null,null,null,null,null,null,null,null,null,null,null,null,null,null,null,null,null,null,null,null,"素手",null,null,null,null,null,"防具なし",null,null,null,null,null,null,null,null,"素手",null,null,null,null,null,"防具なし",null,null,null,null,null,null,null,null,"素手",null,null,null,null,null,"防具なし",null,null,null,null,null,null,null,null,"素手",null,null,null,null,null,"防具なし",null,null,null,null,null,null,null,null,"素手",null,null,null,null,null,"防具なし"]
[]
[null,null,null,null,null,null,null,null,null,null,null,null,null,null,null,null,null,null,null,null,null,null,null,null,null,null,null,null,"盾なし",null,null,null,null,null,null,null,null,null,null,null,null,null,null,"盾なし",null,null,null,null,null,null,null,null,null,null,null,null,null,null,"盾なし",null,null,null,null,null,null,null,null,null,null,null,null,null,null,"盾なし",null,null,null,null,null,null,null,null,null,null,null,null,null,null,"盾なし"]
[null,null,null,null,null,null,null,null,null,null,null,null,null,null,null,null,null,null,null,null,null,null,"指輪",null,null,null,null,null,null,null,null,null,null,null,null,null,null,"指輪",null,null,null,null,null,null,null,null,null,null,null,null,null,null,"指輪",null,null,null,null,null,null,null,null,null,null,null,null,null,null,"指輪",null,null,null,null,null,null,null,null,null,null,null,null,null,null,"指輪"]
[null,null,null,null,null,null,null,null,null,null,null,null,null,null,null,null,null,null,null,null,null,null,"なし",null,null,null,null,null,"なし",null,null,null,null,null,null,null,null,"なし",null,null,null,null,null,"なし",null,null,null,null,null,null,null,null,"なし",null,null,null,null,null,"なし",null,null,null,null,null,null,null,null,"なし",null,null,null,null,null,"なし",null,null,null,null,null,null,null,null,"なし",null,null,null,null,null,"なし"]
[]
[null,null,null,null,null,null,null,null,null,null,null,null,null,null,null,null,null,null,null,null,null,null,"もちもの",null,null,null,null,"重さ",null,{"$f":"AA24*1+AA25*3+AA26*3+AA27+AA28+AG24*5+AG25*5+AG26*3+AG27+AG28*10","v":0},null,"/",{"$f":"IF(AA13=\"かいりき\",120,100)","v":100},null,null,null,null,"もちもの",null,null,null,null,"重さ",null,{"$f":"AP24*1+AP25*3+AP26*3+AP27+AP28+AV24*5+AV25*5+AV26*3+AV27+AV28*10","v":0},null,"/",{"$f":"IF(AP13=\"かいりき\",120,100)","v":100},null,null,null,null,"もちもの",null,null,null,null,"重さ",null,{"$f":"BE24*1+BE25*3+BE26*3+BE27+BE28+BK24*5+BK25*5+BK26*3+BK27+BK28*10","v":0},null,"/",{"$f":"IF(BE13=\"かいりき\",120,100)","v":100},null,null,null,null,"もちもの",null,null,null,null,"重さ",null,{"$f":"BT24*1+BT25*3+BT26*3+BT27+BT28+BZ24*5+BZ25*5+BZ26*3+BZ27+BZ28*10","v":0},null,"/",{"$f":"IF(BT13=\"かいりき\",120,100)","v":100},null,null,null,null,"もちもの",null,null,null,null,"重さ",null,{"$f":"CI24*1+CI25*3+CI26*3+CI27+CI28+CO24*5+CO25*5+CO26*3+CO27+CO28*10","v":0},null,"/",{"$f":"IF(CI13=\"かいりき\",120,100)","v":100}]
[null,null,null,null,null,null,null,null,null,null,null,null,null,null,null,null,null,null,null,null,null,null,"金貨",null,null,null,0,null,"食料",null,null,null,0,null,null,null,null,"金貨",null,null,null,0,null,"食料",null,null,null,0,null,null,null,null,"金貨",null,null,null,0,null,"食料",null,null,null,0,null,null,null,null,"金貨",null,null,null,0,null,"食料",null,null,null,0,null,null,null,null,"金貨",null,null,null,0,null,"食料",null,null,null,0]
[null,null,null,null,null,null,null,null,null,null,null,null,null,null,null,null,null,null,null,null,null,null,"回復薬",null,null,null,0,null,"けむり玉",null,null,null,0,null,null,null,null,"回復薬",null,null,null,0,null,"けむり玉",null,null,null,0,null,null,null,null,"回復薬",null,null,null,0,null,"けむり玉",null,null,null,0,null,null,null,null,"回復薬",null,null,null,0,null,"けむり玉",null,null,null,0,null,null,null,null,"回復薬",null,null,null,0,null,"けむり玉",null,null,null,0]
[null,null,null,null,null,null,null,null,null,null,null,null,null,null,null,null,null,null,null,null,null,null,"たいまつ",null,null,null,0,null,"ちしきの本",null,null,null,0,null,null,null,null,"たいまつ",null,null,null,0,null,"ちしきの本",null,null,null,0,null,null,null,null,"たいまつ",null,null,null,0,null,"ちしきの本",null,null,null,0,null,null,null,null,"たいまつ",null,null,null,0,null,"ちしきの本",null,null,null,0,null,null,null,null,"たいまつ",null,null,null,0,null,"ちしきの本",null,null,null,0]
[null,null,null,null,null,null,null,null,null,null,null,null,null,null,null,null,null,null,null,null,null,null,"まほうの粉",null,null,null,0,null,"幸運の石",null,null,null,0,null,null,null,null,"まほうの粉",null,null,null,0,null,"幸運の石",null,null,null,0,null,null,null,null,"まほうの粉",null,null,null,0,null,"幸運の石",null,null,null,0,null,null,null,null,"まほうの粉",null,null,null,0,null,"幸運の石",null,null,null,0,null,null,null,null,"まほうの粉",null,null,null,0,null,"幸運の石",null,null,null,0]
[null,null,null,null,null,null,null,null,null,null,null,null,null,null,null,null,null,null,null,null,null,null,"宝石",null,null,null,0,null,"宝箱",null,null,null,0,null,null,null,null,"宝石",null,null,null,0,null,"宝箱",null,null,null,0,null,null,null,null,"宝石",null,null,null,0,null,"宝箱",null,null,null,0,null,null,null,null,"宝石",null,null,null,0,null,"宝箱",null,null,null,0,null,null,null,null,"宝石",null,null,null,0,null,"宝箱",null,null,null,0]
[]
[]
{"$rows_left_out":17}
{"sheet":"冒険の書","index":1,"n_rows":126,"n_cols":11,"rows_kept":126,"cut":false,"hidden":false,"merged":[[3,2,3,5],[11,2,11,5],[11,7,11,9],[11,11,11,12],[12,2,12,5],[12,7,12,9],[12,11,12,12],[7,2,7,5],[5,6,5,12],[7,6,7,12],[10,2,10,5],[10,7,10,9],[10,11,10,12],[9,2,9,12],[5,2,5,5],[6,2,6,5],[4,2,4,5],[6,6,6,12],[4,6,4,12],[15,2,15,5],[15,7,15,9],[15,11,15,12],[18,2,19,12],[17,2,17,12],[21,2,21,12],[13,2,13,5],[13,7,13,9],[13,11,13,12],[14,2,14,5],[14,7,14,9],[14,11,14,12],[32,2,32,5],[32,6,32,12],[33,2,33,5],[33,6,33,12],[35,2,35,12],[36,2,36,5],[36,7,36,9],[36,11,36,12],[22,2,24,12],[29,2,29,5],[30,2,30,5],[30,6,30,12],[31,2,31,5],[31,6,31,12],[39,2,39,5],[39,7,39,9],[39,11,39,12],[40,2,40,5],[40,7,40,9],[40,11,40,12],[37,2,37,5],[37,7,37,9],[37,11,37,12],[38,2,38,5],[38,7,38,9],[38,11,38,12],[48,2,50,12],[55,2,55,5],[56,2,56,5],[56,6,56,12],[57,2,57,5],[57,6,57,12],[41,2,41,5],[41,7,41,9],[41,11,41,12],[43,2,43,12],[44,2,45,12],[47,2,47,12],[63,2,63,5],[63,7,63,9],[63,11,63,12],[64,2,64,5],[64,7,64,9],[64,11,64,12],[58,2,58,5],[58,6,58,12],[59,2,59,5],[59,6,59,12],[61,2,61,12],[62,2,62,5],[62,7,62,9],[62,11,62,12],[67,2,67,5],[67,7,67,9],[67,11,67,12],[69,2,69,12],[70,2,71,12],[73,2,73,12],[65,2,65,5],[65,7,65,9],[65,11,65,12],[66,2,66,5],[66,7,66,9],[66,11,66,12],[84,2,84,5],[84,6,84,12],[85,2,85,5],[85,6,85,12],[87,2,87,12],[88,2,88,5],[88,7,88,9],[88,11,88,12],[74,2,76,12],[81,2,81,5],[82,2,82,5],[82,6,82,12],[83,2,83,5],[83,6,83,12],[91,2,91,5],[91,7,91,9],[91,11,91,12],[92,2,92,5],[92,7,92,9],[92,11,92,12],[89,2,89,5],[89,7,89,9],[89,11,89,12],[90,2,90,5],[90,7,90,9],[90,11,90,12],[100,2,102,12],[107,2,107,5],[108,2,108,5],[108,6,108,12],[109,2,109,5],[109,6,109,12],[93,2,93,5],[93,7,93,9],[93,11,93,12],[95,2,95,12],[96,2,97,12],[99,2,99,12],[115,2,115,5],[115,7,115,9],[115,11,115,12],[116,2,116,5],[116,7,116,9],[116,11,116,12],[110,2,110,5],[110,6,110,12],[111,2,111,5],[111,6,111,12],[113,2,113,12],[114,2,114,5],[114,7,114,9],[114,11,114,12],[126,2,128,12],[119,2,119,5],[119,7,119,9],[119,11,119,12],[121,2,121,12],[122,2,123,12],[125,2,125,12],[117,2,117,5],[117,7,117,9],[117,11,117,12],[118,2,118,5],[118,7,118,9],[118,11,118,12]]}
[null,"冒険終了時に書く日記のようなものです。"]
[null,"※冒険書が足りなくなったら、その都度セルをコピーしてご利用ください！"]
[]
[null,null,"【冒険の書】"]
[null,null,"日付："]
[null,null,"冒険回数：",null,null,null,1]
[null,null,"クエスト名：",null,null,null,"7：通常"]
[null,null,"評価：",null,null,null,5]
[]
[null,null,"冒険者名/やくわり/レベル"]
[null,null,null,null,null,null,"/",null,null,null,"/"]
[null,null,null,null,null,null,"/",null,null,null,"/"]
[null,null,null,null,null,null,"/",null,null,null,"/"]
[null,null,null,null,null,null,"/",null,null,null,"/"]
[null,null,null,null,null,null,"/",null,null,null,"/"]
[null,null,null,null,null,null,"/",null,null,null,"/"]
[]
[null,null,"ゲットしたおたから"]
[]
[]
[]
[null,null,"その他感想やメモ"]
[]
[]
[]
[]
[]
[]
[]
[null,null,"【冒険の書】"]
{"$rows_left_out":97}
{"sheet":"使い方マニュアル","index":2,"n_rows":74,"n_cols":6,"rows_kept":74,"cut":false,"hidden":false,"merged":[]}
[]
["メイン画面説明"]
[null,null,null,null,null,"１：クリックするとサイコロを２つ振ることができます。"]
[null,null,null,null,null,"1つだけ振る必要があるときは左の数値を、2個同時の時は両方の数字を参照ください。"]
[null,null,null,null,null,"時折エラーが出ることがありますが、その場合は一旦終了して、再度ボタンをクリックしてください。"]
[]
[null,null,null,null,null,"２：クエストの設定を行います"]
[]
[null,null,null,null,null,"３：モンスターが出現した場合、名前を選択すると画像、攻撃力、体力も表示されます。"]
[null,null,null,null,null,"一番右の四角いセルは与えたダメージをメモしておく場所です。"]
[]
[null,null,null,null,null,"４：マップ部分です。⑤のタイルをコピーして配置します。"]
[null,null,null,null,null,"タイル画像をクリックすると緑色の●が表示されるので、そこをドラッグ＆ドロップすることで回転も可能です。"]
[]
[]
[]
[null,null,null,null,null,"５：マップに配置するタイル置き場です。"]
[]
[null,null,null,null,null,"６：ゲーム開始時に人数を設定しておくセルです。人数により、一部モンスターの体力が変化します。"]
[]
[null,null,null,null,null,"７：扉や商人などがイベントで発生した場合などに使うタイルです。"]
[null,null,null,null,null,"その他自由にご活用ください。"]
[]
[null,null,null,null,null,"８：キャラクターシートです。詳細は下のキャラクターシート説明で。"]
[]
[]
[]
["キャラクターシート説明"]
[null,null,null,null,null,"１：なまえ、やくわり、レベルなどを入力します。"]
[null,null,null,null,null,"やくわりやレベルに応じた たいりょく、とくぎなどは自動に入力されます。"]
{"$rows_left_out":45}
{"sheet":"DATA","index":3,"n_rows":305,"n_cols":21,"rows_kept":305,"cut":false,"hidden":false,"merged":[]}
[]
[null,"※このシートはデータ類です！　いじると表示が変になるので触らないでね(・ω・)ﾉｼ"]
[]
[null,"数字",null,"やくわり",null,null,"とくぎ","特殊なとくぎ","武器","防具","指輪","さいころ",null,null,null,null,null,"クエスト","危険な冒険"]
[null,0,null,"せんし",null,null,"えんごこうげき1",null,"素手","防具なし","なし",null,null,null,null,null,null,null,"０：設定なし（通常の冒険）",null,"ボスモンスター（※１）を倒します。 倒した時点でクリアです\n報酬：最も高いボスの（こうげきりょく＋たいりょく）×２\n高評価：報酬が３６以上"]
[null,1,null,"そうりょ",null,null,"えんごこうげき2","かばう","剣：たいりょく＋５","ローブ：たいりょく＋３","指輪＋１",null,null,null,null,null,null,null,"１：危険地帯 \n全てのモンスターの\nこうげきりょく＋たいりょくが２倍\n報酬で得られる「けいけん」が２倍  ",null,"6種類の地形（直線は扉ありと無し、同じとします）のうち、任意の１つを選びます。その地形をできるだけ多く発見するのが目的です\n報酬：発見した地形×５\n高評価：報酬が２５以上"]
[null,2,null,"まほうつかい",null,null,"かいふく1","いのちのオーラ","棍棒：攻撃成功後にたいりょくを-５して ＋１ダメージすることが可能","皮の鎧：たいりょく＋５","指輪＋２",null,null,null,null,null,null,null,"２：超危険地帯\n全てのモンスターの\nこうげきりょく＋たいりょくが３倍\n報酬で得られる「けいけん」が３倍  ",null,"モンスターをできるだけ多く倒します。\n種類は問いません\n報酬：モンスターを倒した数\n高評価：報酬が２０以上"]
[null,3,null,"にんじゃ",null,null,"まほう1","だいまほう","槍：相打ち時のダメージ-1","鎖かたびら：たいりょく＋８","指輪＋３",null,null,null,null,null,null,null,"３：呪われた迷宮\n呪いの効果で回復薬を使用しても 「たいりょく」が回復しません。\n報酬で得られる「けいけん」が３倍  ",null,"お金を一定量稼ぎます\n報酬：稼いだ金貨数÷１０（端数切り上げ）\n高評価：報酬が２５以上"]
[null,4,null,"かりうど",null,null,"おたから1","しゅうちゅう","斧：受けるダメージ＋２、与えるダメージ＋１","鉄の鎧：たいりょく＋１０","指輪＋４",null,null,null,null,null,null,null,"４：極寒の迷宮\n「たいりょく」の上限が半分（端数切り上げ）になり、食糧が倍消費します。\n報酬で得られる「けいけん」が２倍  ",null,"まずは２Dで特定のモンスターを決定します。\nそのモンスターを、できるだけ多く倒すのが\n目的です\n報酬：モンスターを倒した数×６\n高評価：報酬が３０以上"]
[null,5,null,"非表示",null,null,"かぎあけ1","ひっさつのいちげき","杖：たいりょく＋５","魔法のローブ：たいりょく＋６","指輪＋５",null,null,null,null,null,null,null,"５：灼熱の迷宮\n１歩歩くごとに 全員の「たいりょく」が１減少します。\n報酬で得られる「けいけん」が２倍  ",null,"自由に探索します （但し、３マス以上進むことが条件です）\n報酬：生還で１人あたり５\n高評価：なし"]
[null,6,null,null,null,null,"かいりき",null,"弓：えんごこうげきを体力-１で使える","魔法の皮の鎧：たいりょく＋１０",null,null,null,null,null,null,null,null,"６：神聖な場所\n全ての武器、防具が使えません。 戦闘は「素手」になります。\n報酬で得られる「けいけん」が２倍  ",null,"迷宮を全て歩きます。\n報酬：進んだ地形×１\n高評価：報酬が２３以上"]
[null,7,null,null,null,null,"かいふく2",null,"短剣：反撃…時のダメージ-1","魔法の鎖かたびら：たいりょく＋１６",null,null,null,null,null,null,null,null,null,null,"まずは２Dで特定のモンスターを決定します。 この冒険では、そのモンスターを倒してはいけません\n報酬：進んだ地形×２。 但し、倒したモンスター×５だけマイナス\n高評価：報酬が４０以上"]
[null,8,null,null,null,null,"まほう2",null,"魔法の剣：たいりょく＋５、あたえるダメージ＋１","魔法の鉄の鎧：たいりょく＋２０",null,null,null,null,null,null,null,null,null,null,"宝箱をできるだけ多く回収します。\n中は開けても構いません\n報酬：回収した宝箱×４\n高評価：報酬が２４以上"]
[null,9,null,null,null,null,"おたから2",null,"魔法の棍棒：攻撃成功後にたいりょくを-５して ＋１ダメージすることが可能、あたえるダメージ＋１","盾なし",null,null,null,null,null,null,null,null,null,null,"全員で一定量ダメージを受ける\n報酬：受けたダメージ/２（端数切り上げ）\n高評価：報酬が５０以上"]
[null,10,null,null,null,null,"かぎあけ2",null,"魔法の槍：相打ち時のダメージ-1、あたえるダメージ＋１","盾：たいりょく＋３",null,null,null,null,null,null,null,null,null,null,"指輪をできるだけ多く入手します\n報酬：回収した指輪×１０\n高評価：報酬が４０以上"]
[null,11,null,null,null,null,null,null,"魔法の斧：受けるダメージ＋２、与えるダメージ＋１、あたえるダメージ＋１","魔法の盾：たいりょく＋６",null,null,"モンスター",null,"攻撃","体力","体力計算用"]
[null,12,null,null,null,null,null,null,"魔法の杖：たいりょく＋５、あたえるダメージ＋１",null,null,null,"なし",null,0,0]
[null,13,null,null,null,null,null,null,"魔法の弓：えんごこうげきを体力-１で使える、あたえるダメージ＋１",null,null,null,"ドラゴン",null,6,{"$f":"地図!G37*2","v":2},null,"2：ボスの討伐","ボスモンスター（※１）を倒します。 倒した時点でクリアです\n報酬：最も高いボスの（こうげきりょく＋たいりょく）×２  高評価：報酬が３６以上"]
[null,14,null,null,null,null,null,null,"魔法の短剣：反撃…時のダメージ-1、あたえるダメージ＋１",null,null,null,"ヴァンパイア",null,5,{"$f":"地図!G37+1","v":2},null,"3：特定の地形を発見","6種類の地形（直線は扉ありと無し、同じとします）のうち、任意の１つを選びます。その地形をできるだけ多く発見するのが目的です\n報酬：発見した地形×５  高評価：報酬が２５以上"]
[null,15,null,null,null,null,null,null,null,null,null,null,"オーガ",null,6,{"$f":"ROUNDUP(Q20,0)","v":1},{"$f":"地図!G37/2","v":0.5},"4：モンスター討伐","モンスターをできるだけ多く倒します。\n種類は問いません\n報酬：モンスターを倒した数  高評価：報酬が２０以上"]
[null,16,null,null,null,null,null,null,null,null,null,null,"サラマンダー",null,3,2,null,"5：財宝の回収","お金を一定量稼ぎます\n報酬：稼いだ金貨数÷１０（端数切り上げ）  高評価：報酬が２５以上"]
[null,17,null,null,null,null,null,null,null,null,null,null,"スケルトン",null,2,2,null,"6：特定モンスターを退治","最初に２Dで特定のモンスターを決定し、そのモンスターを多く倒すのが目的です。\n報酬：モンスターを倒した数×６  高評価：報酬が３０以上"]
[null,18,null,null,null,null,null,null,null,null,null,null,"ゴブリン",null,2,1,null,"7：通常","自由に探索します （但し、３マス以上進むことが条件です）\n報酬：生還で１人あたり５  高評価：なし"]
[null,19,null,null,null,null,null,null,null,null,null,null,"ゴースト",null,2,{"$f":"地図!G37","v":1},null,"8：探索","迷宮を全て歩きます。\n報酬：進んだ地形×１  高評価：報酬が２３以上"]
[null,20,null,null,null,null,null,null,null,null,null,null,"ケイブベア",null,4,2,null,"9：特定のモンスター調査","２Dで特定のモンスターを決定します。 この冒険では、そのモンスターを倒してはいけません\n報酬：進んだ地形×２-倒した特定のﾓﾝｽﾀｰ×５  高評価：報酬４０以上"]
[null,21,null,null,null,null,null,null,null,null,null,null,"サイクロプス",null,4,{"$f":"ROUNDUP(Q26,0)","v":1},{"$f":"地図!G37/2","v":0.5},"10：宝箱の回収","宝箱をできるだけ多く回収します。\n中は開けても構いません\n報酬：回収した宝箱×４  高評価：報酬が２４以上"]
[null,22,null,null,null,null,null,null,null,null,null,null,"ネクロマンサー",null,5,{"$f":"地図!G37","v":1},null,"11：負傷テスト","全員で一定量ダメージを受ける\n報酬：受けたダメージ/２（端数切り上げ）  高評価：報酬が５０以上"]
[null,23,null,null,null,null,null,null,null,null,null,null,"デーモン",null,6,{"$f":"地図!G37+1","v":2},null,"12：指輪の探索","指輪をできるだけ多く入手します\n報酬：回収した指輪×１０  高評価：報酬が４０以上"]
[null,24]
[null,25]
{"$rows_left_out":275}